BDBM50053733 5,5-Dimethyl-3-[4-(4-o-tolyl-piperazin-1-yl)-butyl]-thiazolidin-4-one::CHEMBL130036
SMILES Cc1ccccc1N1CCN(CCCCN2CSC(C)(C)C2=O)CC1
InChI Key InChIKey=XTVSAOCUGHTFMT-UHFFFAOYSA-N
Data  2 IC50
  Tab Delimited (TSV)   2D SDfile   Computed 3D by Vconf -m prep SDfile
Find this compound or compounds like it in BindingDB:
Activity Spreadsheet -- Enzyme Inhibition Constant Data from BindingDB
Found 1 hit for monomerid = 50053733
TargetD(2) dopamine receptor(Rattus norvegicus (rat))
Hoechst Marion Roussel
Curated by ChEMBL
LigandPNGBDBM50053733(5,5-Dimethyl-3-[4-(4-o-tolyl-piperazin-1-yl)-butyl...)
Affinity DataIC50:  1.77E+3nM. Assay description: Binding affinity towards Dopamine receptor D2 was determined in rat striatum using [3H]- spiperone as radioligand
In DepthDetails ArticlePubMed